UniverseUniversity


Home Projects Jobs Clientele Contact

uu


[Date Prev][Date Next][Thread Prev][Thread Next][Date Index][Thread Index]

Build errors



Tried to build current SVN and got this:

[ 83%] Building CXX object themes/CMakeFiles/green.dir/green/HomeView.o
HomeView.csp: In member function ‘virtual void
CspServletHomeView_csp::doGet(servlet::HttpServletRequest&,
servlet::HttpServletResponse&)’:
HomeView.csp:15: error: ‘class CConnection’ has no member named
‘listPersonCourses’
HomeView.csp:20: error: ‘class CConnection’ has no member named
‘listPersonTopics’
HomeView.csp:25: error: ‘class CConnection’ has no member named
‘listPersonExplanations’
HomeView.csp:30: error: ‘class CConnection’ has no member named
‘listPersonProblems’
make[2]: *** [themes/CMakeFiles/green.dir/green/HomeView.o] Error 1


Authoright © Total Knowledge: 2001-2008